created_at,username,name,blog,company,bio,avatar_url,hireable,num_followers,num_following,created_at,star_time
2019-03-28 00:08:02,damonyoungs,,,,,https://avatars0.githubusercontent.com/u/48997513?v=4,False,0,0,2019-03-28 00:08:02,2019-03-29 13:34:53
2019-03-28 00:11:02,EscapeFromCoding,,,,,https://avatars3.githubusercontent.com/u/48997624?v=4,False,0,0,2019-03-28 00:11:02,2019-03-28 00:12:46
2019-03-28 01:12:57,Artyom2033,,,,,https://avatars1.githubusercontent.com/u/48999390?v=4,False,0,0,2019-03-28 01:12:57,2019-03-28 01:34:57
2019-03-28 01:13:24,857092,,,,,https://avatars3.githubusercontent.com/u/48999405?v=4,False,0,0,2019-03-28 01:13:24,2019-03-28 10:50:48
2019-03-28 01:22:39,ZipperYoung,,,,,https://avatars1.githubusercontent.com/u/48999654?v=4,False,0,0,2019-03-28 01:22:39,2019-04-01 17:32:03
2019-03-28 01:44:53,Heinirchs,,,,,https://avatars3.githubusercontent.com/u/49000275?v=4,False,0,0,2019-03-28 01:44:53,2019-03-29 15:06:14
2019-03-28 02:16:26,2018offer,,,,,https://avatars3.githubusercontent.com/u/49001122?v=4,False,0,0,2019-03-28 02:16:26,2019-03-28 02:19:48
2019-03-28 02:18:03,lancelot981,,,,,https://avatars0.githubusercontent.com/u/49001174?v=4,False,0,0,2019-03-28 02:18:03,2019-03-28 02:19:35
2019-03-28 02:27:38,haoxin-at-twitter,Haoxin Li,,Twitter,,https://avatars1.githubusercontent.com/u/49001392?v=4,False,0,0,2019-03-28 02:27:38,2019-03-30 06:17:59
2019-03-28 02:44:38,luoyics,,,,,https://avatars3.githubusercontent.com/u/49001807?v=4,False,0,0,2019-03-28 02:44:38,2019-03-28 02:48:38
2019-03-28 05:02:08,CHOOO3,,,,,https://avatars2.githubusercontent.com/u/49004910?v=4,False,0,0,2019-03-28 05:02:08,2019-03-28 05:10:03
2019-03-28 05:48:23,zoulan112233,,,,,https://avatars0.githubusercontent.com/u/49005796?v=4,False,0,0,2019-03-28 05:48:23,2019-03-29 17:25:01
2019-03-28 08:00:50,fukunarixia,,,,,https://avatars2.githubusercontent.com/u/49007934?v=4,False,0,0,2019-03-28 08:00:50,2019-03-28 08:02:28
2019-03-28 08:12:07,ilovely1314,,,,,https://avatars1.githubusercontent.com/u/49008133?v=4,False,0,0,2019-03-28 08:12:07,2019-03-28 08:18:10
2019-03-28 08:40:57,whatswater,,,,,https://avatars0.githubusercontent.com/u/49008661?v=4,False,0,0,2019-03-28 08:40:57,2019-03-28 08:43:57
2019-03-28 08:49:41,triplepoi,triplepoi,,,,https://avatars3.githubusercontent.com/u/49008848?v=4,False,0,0,2019-03-28 08:49:41,2019-03-28 09:13:27
2019-03-28 08:50:04,slei0528,,,,,https://avatars3.githubusercontent.com/u/49008855?v=4,False,0,0,2019-03-28 08:50:04,2019-03-28 08:57:27
2019-03-28 08:50:22,ai14090759,,,,,https://avatars1.githubusercontent.com/u/49008861?v=4,False,0,0,2019-03-28 08:50:22,2019-03-30 13:44:46
2019-03-28 08:56:37,no256,,,,,https://avatars0.githubusercontent.com/u/49008993?v=4,False,0,0,2019-03-28 08:56:37,2019-03-28 08:59:42
2019-03-28 08:58:42,alexz4321,,,,,https://avatars2.githubusercontent.com/u/49009039?v=4,False,0,0,2019-03-28 08:58:42,2019-03-28 09:18:05
2019-03-28 08:58:50,fangzteng,,,,,https://avatars3.githubusercontent.com/u/49009046?v=4,False,0,0,2019-03-28 08:58:50,2019-03-28 09:01:31
2019-03-28 09:00:42,goodlucklxx704,,,,,https://avatars1.githubusercontent.com/u/49009075?v=4,False,0,0,2019-03-28 09:00:42,2019-03-28 14:45:32
2019-03-28 09:02:59,wkaifan,,,,,https://avatars3.githubusercontent.com/u/49009132?v=4,False,0,0,2019-03-28 09:02:59,2019-03-28 09:04:57
2019-03-28 09:12:19,XYJ0216,,,,,https://avatars2.githubusercontent.com/u/49009330?v=4,False,0,0,2019-03-28 09:12:19,2019-04-02 14:17:17
2019-03-28 09:12:45,lifan120,,,,,https://avatars2.githubusercontent.com/u/49009337?v=4,False,0,0,2019-03-28 09:12:45,2019-03-28 09:15:03
2019-03-28 09:13:41,smilybobo,,,,,https://avatars3.githubusercontent.com/u/49009356?v=4,False,0,0,2019-03-28 09:13:41,2019-03-28 09:16:14
2019-03-28 09:15:52,bagwel1,,,,,https://avatars3.githubusercontent.com/u/49009408?v=4,False,0,0,2019-03-28 09:15:52,2019-03-28 09:18:26
2019-03-28 09:17:11,lccclclclclclclcl,,,,,https://avatars1.githubusercontent.com/u/49009449?v=4,False,0,0,2019-03-28 09:17:11,2019-03-29 15:17:12
2019-03-28 09:18:41,Ragnarok-E4,魔王,,,,https://avatars3.githubusercontent.com/u/49009481?v=4,False,0,0,2019-03-28 09:18:41,2019-03-28 09:32:04
2019-03-28 09:19:16,august915,北妖,,,,https://avatars2.githubusercontent.com/u/49009500?v=4,False,0,0,2019-03-28 09:19:16,2019-03-28 09:22:54
2019-03-28 09:23:28,sunpeng-china,,,,,https://avatars2.githubusercontent.com/u/49009610?v=4,False,0,0,2019-03-28 09:23:28,2019-03-29 17:36:52
2019-03-28 09:26:23,huxu1028,,,,,https://avatars2.githubusercontent.com/u/49009682?v=4,False,0,0,2019-03-28 09:26:23,2019-03-28 09:40:47
2019-03-28 09:27:24,a328685072,,,,,https://avatars3.githubusercontent.com/u/49009705?v=4,False,0,0,2019-03-28 09:27:24,2019-03-28 09:32:14
2019-03-28 09:28:41,zijinwangchao,,,,,https://avatars0.githubusercontent.com/u/49009723?v=4,False,0,0,2019-03-28 09:28:41,2019-03-30 09:17:41
2019-03-28 09:29:55,zhangjianRules,,,,,https://avatars1.githubusercontent.com/u/49009746?v=4,False,0,0,2019-03-28 09:29:55,2019-03-28 14:33:27
2019-03-28 09:30:54,stevenkmym,,,,,https://avatars3.githubusercontent.com/u/49009772?v=4,False,0,0,2019-03-28 09:30:54,2019-03-29 09:34:51
2019-03-28 09:32:17,jayzou98,,,,,https://avatars3.githubusercontent.com/u/49009808?v=4,False,0,0,2019-03-28 09:32:17,2019-03-28 09:34:59
2019-03-28 09:37:56,StevenZhou-MXR,,,,,https://avatars0.githubusercontent.com/u/49009933?v=4,False,0,0,2019-03-28 09:37:56,2019-03-28 09:45:46
2019-03-28 09:39:58,tenshours,,,,,https://avatars3.githubusercontent.com/u/49009967?v=4,False,0,0,2019-03-28 09:39:58,2019-03-28 10:49:05
2019-03-28 09:40:58,MjzzZ0oO,,,,,https://avatars2.githubusercontent.com/u/49009988?v=4,False,0,0,2019-03-28 09:40:58,2019-03-28 10:00:05
2019-03-28 09:41:29,YuBanX,,,,,https://avatars3.githubusercontent.com/u/49009998?v=4,False,0,0,2019-03-28 09:41:29,2019-03-28 09:44:09
2019-03-28 09:42:01,ssp111,,,,,https://avatars0.githubusercontent.com/u/49010010?v=4,False,0,0,2019-03-28 09:42:01,2019-03-28 09:55:21
2019-03-28 09:42:03,Solo8World,,,,,https://avatars0.githubusercontent.com/u/49010011?v=4,False,0,0,2019-03-28 09:42:03,2019-03-28 09:54:44
2019-03-28 09:42:31,guochuang123,,,,,https://avatars2.githubusercontent.com/u/49010020?v=4,False,0,0,2019-03-28 09:42:31,2019-03-28 09:50:25
2019-03-28 09:42:36,tanggom,,,,,https://avatars2.githubusercontent.com/u/49010024?v=4,False,0,0,2019-03-28 09:42:36,2019-03-28 09:43:37
2019-03-28 09:45:59,hoiwon,,,,,https://avatars0.githubusercontent.com/u/49010108?v=4,False,0,0,2019-03-28 09:45:59,2019-03-28 09:53:27
2019-03-28 09:48:15,lalalalovewh,,,,,https://avatars0.githubusercontent.com/u/49010160?v=4,False,0,0,2019-03-28 09:48:15,2019-03-28 11:55:43
2019-03-28 09:49:06,luterdans,,,,,https://avatars1.githubusercontent.com/u/49010173?v=4,False,0,1,2019-03-28 09:49:06,2019-03-28 10:59:23
2019-03-28 09:49:48,jarvanshen,,,,,https://avatars1.githubusercontent.com/u/49010188?v=4,False,0,0,2019-03-28 09:49:48,2019-03-28 10:22:19
2019-03-28 09:50:56,LuckyHXQ,LuckyHXQ,https://weibo.com/luckyhxq,LuckyHJF,I like SLEEP,https://avatars3.githubusercontent.com/u/49010221?v=4,True,0,0,2019-03-28 09:50:56,2019-03-31 10:39:51
2019-03-28 09:51:44,Lala1217,,,,,https://avatars2.githubusercontent.com/u/49010235?v=4,False,0,0,2019-03-28 09:51:44,2019-03-28 10:28:54
2019-03-28 09:52:35,Candycow,,,,,https://avatars3.githubusercontent.com/u/49010256?v=4,False,0,0,2019-03-28 09:52:35,2019-03-28 10:04:18
2019-03-28 09:53:27,NanoXu1,,,,,https://avatars0.githubusercontent.com/u/49010273?v=4,False,0,0,2019-03-28 09:53:27,2019-04-01 09:11:34
2019-03-28 09:55:21,JackarooChow,,,,,https://avatars2.githubusercontent.com/u/49010331?v=4,False,0,0,2019-03-28 09:55:21,2019-03-28 09:56:24
2019-03-28 09:56:22,Weee1,,,,,https://avatars2.githubusercontent.com/u/49010358?v=4,False,0,0,2019-03-28 09:56:22,2019-03-28 09:58:30
2019-03-28 09:57:49,blind-bird,,,,,https://avatars2.githubusercontent.com/u/49010400?v=4,False,0,0,2019-03-28 09:57:49,2019-04-01 15:14:01
2019-03-28 09:58:02,ryasun,,,,,https://avatars3.githubusercontent.com/u/49010408?v=4,False,0,0,2019-03-28 09:58:02,2019-03-28 09:59:15
2019-03-28 09:58:29,DXHSteven,,,,,https://avatars3.githubusercontent.com/u/49010413?v=4,False,0,0,2019-03-28 09:58:29,2019-03-28 10:01:10
2019-03-28 09:59:21,Nealzaza,,,,,https://avatars1.githubusercontent.com/u/49010438?v=4,False,0,1,2019-03-28 09:59:21,2019-03-29 09:52:20
2019-03-28 10:00:11,EricDaiJiaQi,,,,,https://avatars3.githubusercontent.com/u/49010460?v=4,False,0,0,2019-03-28 10:00:11,2019-03-28 10:03:19
2019-03-28 10:01:01,LLLinggg,,,,,https://avatars3.githubusercontent.com/u/49010483?v=4,False,0,0,2019-03-28 10:01:01,2019-03-28 13:17:32
2019-03-28 10:01:49,xixishao,,,,,https://avatars2.githubusercontent.com/u/49010503?v=4,False,0,0,2019-03-28 10:01:49,2019-04-01 17:47:11
2019-03-28 10:03:11,libaican,,,,,https://avatars0.githubusercontent.com/u/49010545?v=4,False,0,0,2019-03-28 10:03:11,2019-03-28 10:36:50
2019-03-28 10:03:29,MrWhite-W,,,,,https://avatars1.githubusercontent.com/u/49010554?v=4,False,0,0,2019-03-28 10:03:29,2019-03-28 10:18:06
2019-03-28 10:03:48,jiemoresmart,,,,,https://avatars3.githubusercontent.com/u/49010566?v=4,False,0,0,2019-03-28 10:03:48,2019-04-02 09:48:09
2019-03-28 10:04:32,1055471363,,,,,https://avatars3.githubusercontent.com/u/49010581?v=4,False,0,0,2019-03-28 10:04:32,2019-03-29 13:54:48
2019-03-28 10:05:14,caicaiwoshinage,,,,,https://avatars3.githubusercontent.com/u/49010598?v=4,False,0,0,2019-03-28 10:05:14,2019-03-28 10:07:20
2019-03-28 10:08:42,lirui9928,,,,,https://avatars2.githubusercontent.com/u/49010678?v=4,False,0,0,2019-03-28 10:08:42,2019-03-28 12:08:05
2019-03-28 10:10:42,xutingran,xutingran,,,,https://avatars0.githubusercontent.com/u/49010739?v=4,False,0,0,2019-03-28 10:10:42,2019-03-28 10:37:00
2019-03-28 10:11:00,thekii,,,,,https://avatars1.githubusercontent.com/u/49010747?v=4,False,0,0,2019-03-28 10:11:00,2019-03-28 10:14:45
2019-03-28 10:11:53,bodang000,,,,,https://avatars2.githubusercontent.com/u/49010763?v=4,False,0,0,2019-03-28 10:11:53,2019-03-29 06:58:17
2019-03-28 10:14:58,SHanwayC,SHanwayC,,,,https://avatars0.githubusercontent.com/u/49010843?v=4,False,0,1,2019-03-28 10:14:58,2019-03-29 15:16:46
2019-03-28 10:14:58,EMPANTI,,,,,https://avatars0.githubusercontent.com/u/49010844?v=4,False,0,0,2019-03-28 10:14:58,2019-03-28 10:23:30
2019-03-28 10:16:43,StillNewbie,,,,,https://avatars2.githubusercontent.com/u/49010892?v=4,False,0,0,2019-03-28 10:16:43,2019-03-28 10:38:58
2019-03-28 10:17:02,AngerHangGe,,,,,https://avatars3.githubusercontent.com/u/49010899?v=4,False,0,0,2019-03-28 10:17:02,2019-03-28 10:22:58
2019-03-28 10:18:12,LiDongHuiS,空瞳,,,,https://avatars0.githubusercontent.com/u/49010934?v=4,False,0,0,2019-03-28 10:18:12,2019-03-28 10:32:40
2019-03-28 10:18:57,yyn0502,,,,,https://avatars1.githubusercontent.com/u/49010955?v=4,False,0,0,2019-03-28 10:18:57,2019-03-28 10:23:20
2019-03-28 10:21:47,EpisodeOnly,MyNameIsDongGe,,,,https://avatars1.githubusercontent.com/u/49011034?v=4,False,0,0,2019-03-28 10:21:47,2019-04-01 15:58:29
2019-03-28 10:21:48,JulianXIII,,,,,https://avatars1.githubusercontent.com/u/49011036?v=4,False,0,0,2019-03-28 10:21:48,2019-03-28 10:45:47
2019-03-28 10:22:40,tinyke,,,,,https://avatars1.githubusercontent.com/u/49011058?v=4,False,0,0,2019-03-28 10:22:40,2019-03-28 10:25:27
2019-03-28 10:22:52,kirakira7,,,,,https://avatars2.githubusercontent.com/u/49011061?v=4,False,0,0,2019-03-28 10:22:52,2019-03-28 10:24:57
2019-03-28 10:23:31,FenrirG,,,,,https://avatars2.githubusercontent.com/u/49011084?v=4,False,0,0,2019-03-28 10:23:31,2019-03-28 10:36:18
2019-03-28 10:23:32,myfid,,,,,https://avatars2.githubusercontent.com/u/49011085?v=4,False,0,0,2019-03-28 10:23:32,2019-03-28 21:18:48
2019-03-28 10:23:57,Mythct,,,,,https://avatars3.githubusercontent.com/u/49011093?v=4,False,0,0,2019-03-28 10:23:57,2019-03-28 10:39:08
2019-03-28 10:24:56,UmbraCi,,,,,https://avatars2.githubusercontent.com/u/49011112?v=4,False,0,0,2019-03-28 10:24:56,2019-03-28 10:32:09
2019-03-28 10:26:42,rundongLi,,,,,https://avatars1.githubusercontent.com/u/49011147?v=4,False,0,0,2019-03-28 10:26:42,2019-03-28 10:27:28
2019-03-28 10:26:49,caoshu07,,,,,https://avatars0.githubusercontent.com/u/49011152?v=4,False,0,0,2019-03-28 10:26:49,2019-03-28 10:30:23
2019-03-28 10:27:22,Mavisyyy,,,,,https://avatars3.githubusercontent.com/u/49011168?v=4,False,0,0,2019-03-28 10:27:22,2019-03-28 10:31:21
2019-03-28 10:27:32,alex0769,,,,,https://avatars3.githubusercontent.com/u/49011173?v=4,False,0,0,2019-03-28 10:27:32,2019-03-28 10:31:08
2019-03-28 10:27:38,lllions,,,,,https://avatars2.githubusercontent.com/u/49011179?v=4,False,0,0,2019-03-28 10:27:38,2019-03-28 10:33:39
2019-03-28 10:28:00,1018412402,七号,,,,https://avatars2.githubusercontent.com/u/49011187?v=4,False,0,0,2019-03-28 10:28:00,2019-04-02 08:21:30
2019-03-28 10:29:21,JerAxCRS,,,,,https://avatars3.githubusercontent.com/u/49011217?v=4,False,0,0,2019-03-28 10:29:21,2019-03-28 10:41:35
2019-03-28 10:31:44,q510060933,,,,,https://avatars2.githubusercontent.com/u/49011290?v=4,False,0,0,2019-03-28 10:31:44,2019-03-28 10:39:50
2019-03-28 10:31:52,joinxin,,,,,https://avatars2.githubusercontent.com/u/49011292?v=4,False,0,0,2019-03-28 10:31:52,2019-03-29 18:58:14
2019-03-28 10:32:10,caohuawen,,,,,https://avatars2.githubusercontent.com/u/49011302?v=4,False,0,0,2019-03-28 10:32:10,2019-03-28 14:28:05
2019-03-28 10:33:05,dywin123,,,,,https://avatars0.githubusercontent.com/u/49011331?v=4,False,0,0,2019-03-28 10:33:05,2019-03-28 10:34:13
2019-03-28 10:33:11,lilychou2019,,,,,https://avatars0.githubusercontent.com/u/49011333?v=4,False,0,0,2019-03-28 10:33:11,2019-03-28 10:38:51
2019-03-28 10:33:51,a398983914,,,,,https://avatars1.githubusercontent.com/u/49011353?v=4,False,0,0,2019-03-28 10:33:51,2019-03-28 10:40:32
2019-03-28 10:34:37,chuplayer,,,,,https://avatars2.githubusercontent.com/u/49011371?v=4,False,0,0,2019-03-28 10:34:37,2019-03-28 11:46:41
2019-03-28 10:38:18,paradiseNoMore,,,,,https://avatars1.githubusercontent.com/u/49011481?v=4,False,0,0,2019-03-28 10:38:18,2019-03-28 10:42:59
2019-03-28 10:39:33,refealbellicmao,,,,,https://avatars1.githubusercontent.com/u/49011508?v=4,False,0,0,2019-03-28 10:39:33,2019-04-01 09:39:54
2019-03-28 10:39:52,clxmlss,,,,,https://avatars0.githubusercontent.com/u/49011519?v=4,False,0,0,2019-03-28 10:39:52,2019-03-28 10:49:00
2019-03-28 10:39:53,fuyunfeiji,,,,,https://avatars3.githubusercontent.com/u/49011520?v=4,False,0,0,2019-03-28 10:39:53,2019-03-28 14:50:37
2019-03-28 10:40:03,shisuorong,,,,,https://avatars3.githubusercontent.com/u/49011526?v=4,False,0,0,2019-03-28 10:40:03,2019-03-28 17:39:34
2019-03-28 10:40:23,afei2019,,,,,https://avatars2.githubusercontent.com/u/49011537?v=4,False,0,0,2019-03-28 10:40:23,2019-03-28 10:41:20
2019-03-28 10:41:57,bmayday,,,,,https://avatars1.githubusercontent.com/u/49011561?v=4,False,0,0,2019-03-28 10:41:57,2019-03-28 10:56:50
2019-03-28 10:42:00,X5207,,,,,https://avatars1.githubusercontent.com/u/49011564?v=4,False,0,0,2019-03-28 10:42:00,2019-03-29 09:39:11
2019-03-28 10:42:07,georgelaker,,,,,https://avatars0.githubusercontent.com/u/49011570?v=4,False,0,0,2019-03-28 10:42:07,2019-03-28 10:55:34
2019-03-28 10:42:14,lc-linux,Cheng,,,,https://avatars0.githubusercontent.com/u/49011574?v=4,False,0,0,2019-03-28 10:42:14,2019-04-02 09:13:19
2019-03-28 10:42:35,chensw0609,,,,,https://avatars1.githubusercontent.com/u/49011584?v=4,False,0,0,2019-03-28 10:42:35,2019-03-28 10:45:14
2019-03-28 10:42:39,ren4152,,,,,https://avatars1.githubusercontent.com/u/49011585?v=4,False,0,0,2019-03-28 10:42:39,2019-03-28 10:49:43
2019-03-28 10:43:19,ZoelBro,,,,,https://avatars1.githubusercontent.com/u/49011600?v=4,False,0,0,2019-03-28 10:43:19,2019-03-28 10:51:12
2019-03-28 10:43:41,sam6666666,sam,,,,https://avatars0.githubusercontent.com/u/49011613?v=4,False,0,0,2019-03-28 10:43:41,2019-03-28 12:27:36
2019-03-28 10:44:19,json-mao,,,,,https://avatars3.githubusercontent.com/u/49011633?v=4,False,0,0,2019-03-28 10:44:19,2019-03-28 10:49:37
2019-03-28 10:44:51,LinBun,LinBun,,,,https://avatars2.githubusercontent.com/u/49011650?v=4,False,0,0,2019-03-28 10:44:51,2019-03-28 13:02:11
2019-03-28 10:45:11,haozisgit,,,,,https://avatars3.githubusercontent.com/u/49011659?v=4,False,0,0,2019-03-28 10:45:11,2019-03-28 13:52:48
2019-03-28 10:46:10,QiuBin0325,,,,,https://avatars1.githubusercontent.com/u/49011676?v=4,False,0,0,2019-03-28 10:46:10,2019-03-28 10:47:22
2019-03-28 10:46:17,dongyuang,,,,,https://avatars0.githubusercontent.com/u/49011680?v=4,False,0,0,2019-03-28 10:46:17,2019-03-28 10:52:40
2019-03-28 10:47:14,ZacharyZang,,,,,https://avatars0.githubusercontent.com/u/49011708?v=4,False,0,0,2019-03-28 10:47:14,2019-03-28 10:50:53
2019-03-28 10:48:03,bothhave,,,,,https://avatars3.githubusercontent.com/u/49011728?v=4,False,0,0,2019-03-28 10:48:03,2019-03-28 10:51:47
2019-03-28 10:49:32,abc65931615,,,,,https://avatars2.githubusercontent.com/u/49011756?v=4,False,0,0,2019-03-28 10:49:32,2019-03-28 10:53:52
2019-03-28 10:51:10,YipengRong,,,,,https://avatars1.githubusercontent.com/u/49011792?v=4,False,0,0,2019-03-28 10:51:10,2019-03-28 17:30:45
2019-03-28 10:51:26,c9257m,,,,,https://avatars1.githubusercontent.com/u/49011794?v=4,False,0,0,2019-03-28 10:51:26,2019-03-28 10:53:40
2019-03-28 10:51:37,swallowpanda,,,,,https://avatars0.githubusercontent.com/u/49011799?v=4,False,0,0,2019-03-28 10:51:37,2019-03-28 23:42:21
2019-03-28 10:52:19,NPUTom,张万强,,西北工业大学,,https://avatars1.githubusercontent.com/u/49011814?v=4,False,0,0,2019-03-28 10:52:19,2019-03-29 00:00:42
2019-03-28 10:52:33,XuQichao,徐启超,,,,https://avatars3.githubusercontent.com/u/49011821?v=4,False,0,0,2019-03-28 10:52:33,2019-03-28 10:55:49
2019-03-28 10:53:35,shylingyu,,,,,https://avatars3.githubusercontent.com/u/49011848?v=4,False,0,0,2019-03-28 10:53:35,2019-03-28 10:55:35
2019-03-28 10:53:51,yyidd,yyidd,,,,https://avatars3.githubusercontent.com/u/49011854?v=4,False,0,0,2019-03-28 10:53:51,2019-03-28 11:03:47
2019-03-28 10:54:01,yuiiga,,,,,https://avatars1.githubusercontent.com/u/49011862?v=4,False,0,0,2019-03-28 10:54:01,2019-03-29 11:45:03
2019-03-28 10:55:37,okokwell,,,,,https://avatars0.githubusercontent.com/u/49011905?v=4,False,0,0,2019-03-28 10:55:37,2019-03-28 11:10:07
2019-03-28 10:55:39,violet0730,,,,,https://avatars0.githubusercontent.com/u/49011907?v=4,False,0,0,2019-03-28 10:55:39,2019-03-28 10:57:45
2019-03-28 10:56:19,zr623128651,张然然,,,,https://avatars2.githubusercontent.com/u/49011928?v=4,False,0,0,2019-03-28 10:56:19,2019-03-28 10:58:53
2019-03-28 10:56:48,aliken1107,,,,,https://avatars2.githubusercontent.com/u/49011941?v=4,False,0,0,2019-03-28 10:56:48,2019-03-28 10:59:41
2019-03-28 10:57:24,raincoatSuit,,,,,https://avatars3.githubusercontent.com/u/49011957?v=4,False,0,0,2019-03-28 10:57:24,2019-03-28 11:03:20
2019-03-28 10:58:21,yu-jian-ge,,,,,https://avatars1.githubusercontent.com/u/49011987?v=4,False,0,0,2019-03-28 10:58:21,2019-03-28 15:32:11
2019-03-28 10:58:23,wenfengshag,,,,,https://avatars0.githubusercontent.com/u/49011990?v=4,False,0,0,2019-03-28 10:58:23,2019-03-28 14:06:46
2019-03-28 10:58:42,mr985,,,,,https://avatars1.githubusercontent.com/u/49011998?v=4,False,0,0,2019-03-28 10:58:42,2019-03-28 11:02:06
2019-03-28 10:59:36,OCPService,,,,,https://avatars3.githubusercontent.com/u/49012021?v=4,False,0,0,2019-03-28 10:59:36,2019-03-28 11:03:05
2019-03-28 11:00:48,testh5,,,,,https://avatars2.githubusercontent.com/u/49012059?v=4,False,0,0,2019-03-28 11:00:48,2019-03-29 09:54:14
2019-03-28 11:01:51,willingpan,,,,,https://avatars1.githubusercontent.com/u/49012084?v=4,False,0,0,2019-03-28 11:01:51,2019-03-28 11:08:51
2019-03-28 11:01:54,ilovexx4ever,,,,,https://avatars1.githubusercontent.com/u/49012087?v=4,False,0,0,2019-03-28 11:01:54,2019-03-29 11:38:20
2019-03-28 11:02:04,fan0528ljc,,,,,https://avatars0.githubusercontent.com/u/49012091?v=4,False,0,0,2019-03-28 11:02:04,2019-03-28 11:07:09
2019-03-28 11:03:42,jaxsanyecao,,,,,https://avatars2.githubusercontent.com/u/49012128?v=4,False,0,0,2019-03-28 11:03:42,2019-04-01 10:27:20
2019-03-28 11:04:07,monkeyToo,,,,,https://avatars2.githubusercontent.com/u/49012145?v=4,False,0,0,2019-03-28 11:04:07,2019-03-28 11:11:28
2019-03-28 11:05:48,tuyuming,,,,,https://avatars1.githubusercontent.com/u/49012185?v=4,False,0,0,2019-03-28 11:05:48,2019-03-28 14:25:26
2019-03-28 11:06:11,zczplus,,,,,https://avatars0.githubusercontent.com/u/49012196?v=4,False,0,0,2019-03-28 11:06:11,2019-03-28 11:28:06
2019-03-28 11:06:39,Banneker,,,,,https://avatars0.githubusercontent.com/u/49012212?v=4,False,0,0,2019-03-28 11:06:39,2019-04-01 10:22:34
2019-03-28 11:07:30,xwdgithub,,,,,https://avatars2.githubusercontent.com/u/49012227?v=4,False,0,0,2019-03-28 11:07:30,2019-03-28 11:15:57
2019-03-28 11:07:41,hesihan28,hesihan,,,,https://avatars3.githubusercontent.com/u/49012232?v=4,False,0,0,2019-03-28 11:07:41,2019-03-28 11:12:51
2019-03-28 11:08:52,fuckfuckfuckfuckfuckfuckfuckfuckfuck,,,,,https://avatars0.githubusercontent.com/u/49012264?v=4,False,0,0,2019-03-28 11:08:52,2019-03-28 11:12:00
2019-03-28 11:10:02,91FeiYing,,,,,https://avatars1.githubusercontent.com/u/49012290?v=4,False,0,0,2019-03-28 11:10:02,2019-03-29 13:57:48
2019-03-28 11:10:39,mrlaoshi,,,,,https://avatars0.githubusercontent.com/u/49012312?v=4,False,0,0,2019-03-28 11:10:39,2019-04-01 12:42:31
2019-03-28 11:12:39,wuchenglinc,,,,,https://avatars0.githubusercontent.com/u/49012364?v=4,False,0,0,2019-03-28 11:12:39,2019-03-28 11:17:10
2019-03-28 11:13:20,Cool45600,,,,,https://avatars1.githubusercontent.com/u/49012374?v=4,False,0,0,2019-03-28 11:13:20,2019-03-28 11:17:08
2019-03-28 11:13:47,github-gsil,,,,,https://avatars1.githubusercontent.com/u/49012391?v=4,False,0,0,2019-03-28 11:13:47,2019-03-29 15:44:50
2019-03-28 11:13:52,isfighting,,,,,https://avatars1.githubusercontent.com/u/49012394?v=4,False,0,0,2019-03-28 11:13:52,2019-03-28 11:23:26
2019-03-28 11:15:44,tonghhh,,,,,https://avatars1.githubusercontent.com/u/49012446?v=4,False,0,0,2019-03-28 11:15:44,2019-03-28 11:53:42
2019-03-28 11:15:54,13501597327,,,,,https://avatars0.githubusercontent.com/u/49012450?v=4,False,0,0,2019-03-28 11:15:54,2019-03-28 11:17:40
2019-03-28 11:16:03,tanjie0327,,,,,https://avatars0.githubusercontent.com/u/49012456?v=4,False,0,0,2019-03-28 11:16:03,2019-03-28 11:20:14
2019-03-28 11:16:37,changxiaoyao,,,,,https://avatars2.githubusercontent.com/u/49012467?v=4,False,0,0,2019-03-28 11:16:37,2019-03-28 11:37:50
2019-03-28 11:16:57,kql580231git,,,,,https://avatars3.githubusercontent.com/u/49012474?v=4,False,0,0,2019-03-28 11:16:57,2019-03-29 11:50:04
2019-03-28 11:17:07,lucktuanzi,,,,,https://avatars2.githubusercontent.com/u/49012479?v=4,False,0,0,2019-03-28 11:17:07,2019-03-28 18:02:03
2019-03-28 11:17:30,RightsAndInterests,,,,,https://avatars2.githubusercontent.com/u/49012487?v=4,False,0,0,2019-03-28 11:17:30,2019-03-28 13:24:05
2019-03-28 11:18:31,pattis0611,,,,,https://avatars2.githubusercontent.com/u/49012514?v=4,False,0,0,2019-03-28 11:18:31,2019-03-28 11:19:21
2019-03-28 11:19:58,DoesThisMelonKeepSweet,,,,,https://avatars1.githubusercontent.com/u/49012543?v=4,False,0,0,2019-03-28 11:19:58,2019-03-28 11:25:03
2019-03-28 11:20:03,Charonisme,,,,,https://avatars1.githubusercontent.com/u/49012545?v=4,False,0,0,2019-03-28 11:20:03,2019-03-29 14:28:15
2019-03-28 11:20:45,joechen007,,,,,https://avatars0.githubusercontent.com/u/49012556?v=4,False,0,0,2019-03-28 11:20:45,2019-03-29 15:19:24
2019-03-28 11:20:50,13080868641,,,,,https://avatars1.githubusercontent.com/u/49012559?v=4,False,0,0,2019-03-28 11:20:50,2019-03-29 16:06:25
2019-03-28 11:21:04,XIEYUYUE,,,,,https://avatars2.githubusercontent.com/u/49012565?v=4,False,0,0,2019-03-28 11:21:04,2019-03-29 15:01:27
2019-03-28 11:21:24,famitouer,famitouer,,,,https://avatars3.githubusercontent.com/u/49012571?v=4,False,0,0,2019-03-28 11:21:24,2019-03-28 16:14:48
2019-03-28 11:21:55,mmtmmqg,,,,,https://avatars3.githubusercontent.com/u/49012588?v=4,False,0,0,2019-03-28 11:21:55,2019-03-28 11:25:47